By using this site, you agree to our updated Privacy Policy and our Terms of Use. Manage your Cookies Settings.
443,270 Members | 1,703 Online
Bytes IT Community
+ Ask a Question
Need help? Post your question and get tips & solutions from a community of 443,270 IT Pros & Developers. It's quick & easy.

DOMImplementationLS' has no member named 'createDOMWriter'

P: 25
Hey,

I am using nnl_ndim-2.0 library, it configures fine but when I am going to install, it stuck with the error snippet as follows

In file included from ../../xercesc/dom/DOMWriter.hpp:26,
from NDimNet.cpp:2:
../../xercesc/dom/DOMWriterFilter.hpp:45: error: conflicting return type specified for 'virtual short int xercesc_3_1::DOMWriterFilter::acceptNode(const xercesc_3_1::DOMNode*) const'
../../xercesc/dom/DOMNodeFilter.hpp:214: error: overriding 'virtual xercesc_3_1::DOMNodeFilter::FilterAction xercesc_3_1::DOMNodeFilter::acceptNode(const xercesc_3_1::DOMNode*) const'
NDimNet.cpp: In member function 'virtual void NDimNet::save(const std::string&, std::ostream&) const':
NDimNet.cpp:215: error: 'class xercesc_3_1::DOMImplementationLS' has no member named 'createDOMWriter'
make[2]: *** [NDimNet.lo] Error 1
make[2]: Leaving directory `/home/ahmed/Thesis/root/log_files/nnl_ndim-2.0/nn/engine'
make[1]: *** [install-recursive] Error 1
make[1]: Leaving directory `/home/ahmed/Thesis/root/log_files/nnl_ndim-2.0/nn'
make: *** [install-recursive] Error 1


I have also installed xerces-src-3.1.1 as pre requisite in order to make install nnl_ndim-2.0, but it contiunously shows me an error of createDOMWriter. If somebody knows how to deal with this error then please help me out.

Thanks in advance....
Sep 2 '11 #1
Share this question for a faster answer!
Share on Google+

Post your reply

Sign in to post your reply or Sign up for a free account.