473,725 Members | 1,842 Online
Bytes | Software Development & Data Engineering Community
+ Post

Home Posts Topics Members FAQ

Fw: [wxPython-users] 1>make_buildinf o.obj : error LNK2019: unresolvedexter nal symbol __imp__RegQuery ValueExA@24 referenced infunction _make_buildinfo 2



----- Forwarded Message ----
From: Josiah Carlson <jc******@uci.e du>
To: f rom <et******@yahoo .com>; wx************@ lists.wxwidgets .org
Sent: Monday, December 4, 2006 10:03:28 PM
Subject: Re: [wxPython-users] 1>make_buildinf o.obj : error LNK2019: unresolved external symbol __imp__RegQuery ValueExA@24 referenced in function _make_buildinfo 2
Ask on py*********@pyt hon.org .

- Josiah

f rom <et******@yahoo .comwrote:
I am trying to debug a segfault which I can not pin down with a simplepytjon script.
For this I have downloaded the free Microsoft visual express c++.
However I am having problems building python2.5.
Anyonehave experience with this ?

1>------ Rebuild All started: Project: make_buildinfo, Configuration: Debug Win32 ------
1>Deleting intermediate and output files for project 'make_buildinfo ', configuration 'Debug|Win32'
1>Compiling...
1>make_buildinf o.c
1>d:\python-2.5\pcbuild8\ma ke_buildinfo.c( 43) : warning C4996: 'strcat' was declared deprecated
1 c:\program files\microsoft visual studio 8\vc\include\st ring..h(78) : see declaration of 'strcat'
1 Message: 'This function or variable may be unsafe. Consider using strcat_s instead. To disable deprecation, use _CRT_SECURE_NO_ DEPRECATE. See online help for details.'
1>d:\python-2.5\pcbuild8\ma ke_buildinfo.c( 47) : warning C4996: 'strcat' was declared deprecated
1 c:\program files\microsoft visual studio 8\vc\include\st ring.h(78) : see declaration of 'strcat'
1 Message: 'This function or variable may be unsafe. Consider using strcat_s instead. To disable deprecation, use _CRT_SECURE_NO_ DEPRECATE. See online help for details.'
1>d:\python-2.5\pcbuild8\ma ke_buildinfo.c( 63) : warning C4996: 'strcat' was declared deprecated
1 c:\program files\microsoft visual studio 8\vc\include\st ring.h(78) : see declaration of 'strcat'
1 Message: 'This function or variable may be unsafe. Consider using strcat_s instead. To disable deprecation, use _CRT_SECURE_NO_ DEPRECATE. See online help for details.'
1>d:\python-2.5\pcbuild8\ma ke_buildinfo.c( 66) : warning C4996: 'strcat' was declared deprecated
1 c:\program files\microsoft visual studio 8\vc\include\st ring.h(78) : see declaration of 'strcat'
1 Message: 'This function or variable may be unsafe. Consider using strcat_s instead. To disable deprecation, use _CRT_SECURE_NO_ DEPRECATE. See online help for details.'
1>d:\python-2.5\pcbuild8\ma ke_buildinfo.c( 69) : warning C4996: 'strcat' was declared deprecated
1 c:\program files\microsoft visual studio 8\vc\include\st ring.h(78) : see declaration of 'strcat'
1 Message: 'This function or variable may be unsafe. Consider using strcat_s instead. To disable deprecation, use _CRT_SECURE_NO_ DEPRECATE. See online help for details.'
1>d:\python-2.5\pcbuild8\ma ke_buildinfo.c( 72) : warning C4996: 'strcat' was declared deprecated
1 c:\program files\microsoft visual studio 8\vc\include\st ring.h(78) : see declaration of 'strcat'
1 Message: 'This function or variable may be unsafe. Consider using strcat_s instead. To disable deprecation, use _CRT_SECURE_NO_ DEPRECATE. See online help for details.'
1>d:\python-2.5\pcbuild8\ma ke_buildinfo.c( 73) : warning C4996:'strcat' was declared deprecated
1 c:\program files\microsoft visual studio 8\vc\include\st ring.h(78) : see declaration of 'strcat'
1 Message: 'This function or variable may be unsafe. Consider using strcat_s instead. To disable deprecation, use _CRT_SECURE_NO_ DEPRECATE. Seeonline help for details.'
1>d:\python-2.5\pcbuild8\ma ke_buildinfo.c( 81) : warning C4996: 'strcat' was declared deprecated
1 c:\program files\microsoft visual studio 8\vc\include\st ring.h(78) : see declarationof 'strcat'
1 Message: 'This function or variable may be unsafe. Consider using strcat_s instead. To disable deprecation, use _CRT_SECURE_NO_ DEPRECATE. See online help for details.'
1>d:\python-2.5\pcbuild8\ma ke_buildinfo.c( 83) : warning C4996: 'strcat' was declared deprecated
1 c:\program files\microsoft visual studio 8\vc\include\st ring.h(78): see declaration of 'strcat'
1 Message: 'This function or variable may be unsafe. Consider using strcat_s instead. To disable deprecation, use _CRT_SECURE_NO_ DEPRECATE. See online help for details.'
1>d:\python-2.5\pcbuild8\ma ke_buildinfo.c( 84) : warning C4996: 'strcat' was declared deprecated
1 c:\program files\microsoft visual studio 8\vc\include\st ring.h(78) : see declaration of 'strcat'
1 Message: 'This function or variable may be unsafe. Consider using strcat_s instead. To disable deprecation, use _CRT_SECURE_NO_ DEPRECATE. See online help for details.'
1>d:\python-2.5\pcbuild8\ma ke_buildinfo.c( 88) : warning C4996: 'unlink' was declared deprecated
1 c:\program files\microsoft visual studio 8\vc\include\st dio.h(290) : see declaration of 'unlink'
1 Message: 'The POSIX name for this item is deprecated. Instead, use the ISO C++ conformant name: _unlink. See online help for details.'
1>Compiling manifest to resources...
1>Linking...
1>make_buildinf o.obj :error LNK2019: unresolved external symbol __imp__RegQuery ValueExA@24 referenced in function _make_buildinfo 2
1>make_buildinf o.obj : error LNK2019: unresolved external symbol __imp__RegOpenK eyA@12 referenced in function _make_buildinfo 2
1>./make_buildinfo. exe : fatal error LNK1120: 2 unresolved externals
1>Build log was saved at "file://d:\Python-2.5\PCbuild8\x8 6-temp-release\make_bu ildinfo\BuildLo g.htm"
1>make_buildinf o - 3 error(s), 11 warning(s)
========== Rebuild All: 0 succeeded, 1 failed, 0 skipped ==========


_______________ _______________ _______________ _______________ _______________ _________
Want to start your own business?
Learn how on Yahoo! Small Business.
http://smallbusiness.yahoo.com/r-index

---------------------------------------------------------------------
To unsubscribe, e-mail: wx************* ***********@lis ts.wxwidgets.or g
For additional commands, e-mail: wx************* ****@lists.wxwi dgets.org




_______________ _______________ _______________ _______________ _______________ _________
Cheap talk?
Check out Yahoo! Messenger's low PC-to-Phone call rates.
http://voice.yahoo.com
Dec 5 '06 #1
2 5329
I have added advapi32 &user32. This is my current result :

I am quite surprised there are so many issues with the solution file
that comes with python25.
I remember py23 built out of the box :(

1>------ Build started: Project: make_versioninf o, Configuration: Debug
Win32 ------
2>------ Build started: Project: make_buildinfo, Configuration: Debug
Win32 ------
1>Linking...
2>Linking...
1>Embedding manifest...
2>Embedding manifest...
2>Build log was saved at
"file://d:\Python-2.5\PCbuild8\x8 6-temp-release\make_bu ildinfo\BuildLo g.htm"
2>make_buildinf o - 0 error(s), 0 warning(s)
1>Performing Custom Build Step
1>Performing Post-Build Event...
1>Build log was saved at
"file://d:\Python-2.5\PCbuild8\x8 6-temp-debug\make_vers ioninfo\BuildLo g.htm"
1>make_versioni nfo - 0 error(s), 0 warning(s)
3>------ Build started: Project: python, Configuration: Debug Win32
------
3>Linking...
3>Embedding manifest...
4>------ Build started: Project: pythoncore, Configuration: Debug Win32
------
3>Build log was saved at
"file://d:\Python-2.5\PCbuild8\x8 6-temp-debug\python\Bu ildLog.htm"
3>python - 0 error(s), 0 warning(s)
4>generate buildinfo
4>cl.exe -c -D_WIN32 -DUSE_DL_EXPORT -D_WINDOWS -DWIN32 -D_WINDLL
-D_DEBUG -MDd ..\Modules\getb uildinfo.c -Fogetbuildinfo. o -I..\Include
-I..\PC
4>Microsoft (R) 32-bit C/C++ Optimizing Compiler Version 14.00.50727.42
for 80x86
4>Copyright (C) Microsoft Corporation. All rights reserved.
4>getbuildinfo. c
4>Linking...
4 Creating library .\./python25_d.lib and object .\./python25_d.exp
5>------ Build started: Project: w9xpopen, Configuration: Debug Win32
------
5>Linking...
4>config.obj : error LNK2001: unresolved external symbol _init_types
4>getversion.ob j : error LNK2019: unresolved external symbol
_Py_GetBuildInf o referenced in function _Py_GetVersion
4>posixmodule.o bj : error LNK2019: unresolved external symbol
__imp__ShellExe cuteA@24 referenced in function _win32_startfil e
4>posixmodule.o bj : error LNK2019: unresolved external symbol
__imp__ShellExe cuteW@24 referenced in function _win32_startfil e
4>sysmodule.ob j : error LNK2019: unresolved external symbol
__Py_svnversion referenced in function _svnversion_ini t
4>./python25_d.dll : fatal error LNK1120: 5 unresolved externals
4>Build log was saved at
"file://d:\Python-2.5\PCbuild8\x8 6-temp-debug\pythoncor e\BuildLog.htm"
4>pythoncore - 6 error(s), 0 warning(s)
5>Embedding manifest...
5>Build log was saved at
"file://d:\Python-2.5\PCbuild8\x8 6-temp-debug\w9xpopen\ BuildLog.htm"
5>w9xpopen - 0 error(s), 0 warning(s)
6>------ Build started: Project: _ctypes, Configuration: Debug Win32
------
7>------ Build started: Project: _msi, Configuration: Debug Win32
------
7>Linking...
6>Linking...
7 Creating library .\./_msi.lib and object .\./_msi.exp
7>_msi.obj : error LNK2019: unresolved external symbol
__imp__RpcStrin gFreeA@4 referenced in function _uuidcreate
7>_msi.obj : error LNK2019: unresolved external symbol
__imp__UuidToSt ringA@8 referenced in function _uuidcreate
7>_msi.obj : error LNK2019: unresolved external symbol
__imp__UuidCrea te@4 referenced in function _uuidcreate
6 Creating library .\./_ctypes_d.lib and object .\./_ctypes_d.exp
7>_msi.obj : error LNK2019: unresolved external symbol _FCIDestroy
referenced in function _fcicreate
7>_msi.obj : error LNK2019: unresolved external symbol _FCIFlushCabine t
referenced in function _fcicreate
7>_msi.obj : error LNK2019: unresolved external symbol _FCIAddFile
referenced in function _fcicreate
7>_msi.obj : error LNK2019: unresolved external symbol _FCICreate
referenced in function _fcicreate
7>_msi.obj : error LNK2019: unresolved external symbol
_MsiCloseHandle @4 referenced in function _msiobj_dealloc
7>_msi.obj : error LNK2019: unresolved external symbol
_MsiRecordGetFi eldCount@4 referenced in function _record_getfiel dcount
7>_msi.obj : error LNK2019: unresolved external symbol
_MsiRecordClear Data@4 referenced in function _record_clearda ta
7>_msi.obj : error LNK2019: unresolved external symbol
_MsiFormatRecor dA@16 referenced in function _msierror
7>_msi.obj : error LNK2019: unresolved external symbol
_MsiRecordGetIn teger@8 referenced in function _msierror
7>_msi.obj : error LNK2019: unresolved external symbol
_MsiGetLastErro rRecord@0 referenced in function _msierror
7>_msi.obj : error LNK2019: unresolved external symbol
_MsiRecordSetSt ringA@12 referenced in function _record_setstri ng
7>_msi.obj : error LNK2019: unresolved external symbol
_MsiRecordSetSt reamA@12 referenced in function _record_setstre am
7>_msi.obj : error LNK2019: unresolved external symbol
_MsiRecordSetIn teger@12 referenced in function _record_setinte ger
7>_msi.obj : error LNK2019: unresolved external symbol
_MsiSummaryInfo GetPropertyA@28 referenced in function
_summary_getpro perty
7>_msi.obj : error LNK2019: unresolved external symbol
_MsiSummaryInfo GetPropertyCoun t@8 referenced in function
_summary_getpro pertycount
7>_msi.obj : error LNK2019: unresolved external symbol
_MsiSummaryInfo SetPropertyA@24 referenced in function
_summary_setpro perty
7>_msi.obj : error LNK2019: unresolved external symbol
_MsiSummaryInfo Persist@4 referenced in function _summary_persis t
7>_msi.obj : error LNK2019: unresolved external symbol
_MsiViewExecute @8 referenced in function _view_execute
7>_msi.obj : error LNK2019: unresolved external symbol _MsiViewFetch@8
referenced in function _view_fetch
7>_msi.obj : error LNK2019: unresolved external symbol
_MsiViewGetColu mnInfo@12 referenced in function _view_getcolumn info
7>_msi.obj : error LNK2019: unresolved external symbol
_MsiViewModify@ 12 referenced in function _view_modify
7>_msi.obj : error LNK2019: unresolved external symbol _MsiViewClose@4
referenced in function _view_close
7>_msi.obj : error LNK2019: unresolved external symbol
_MsiDatabaseOpe nViewA@12 referenced in function _msidb_openview
7>_msi.obj : error LNK2019: unresolved external symbol
_MsiDatabaseCom mit@4 referenced in function _msidb_commit
7>_msi.obj : error LNK2019: unresolved external symbol
_MsiGetSummaryI nformationA@16 referenced in function
_msidb_getsumma ryinformation
7>_msi.obj : error LNK2019: unresolved external symbol
_MsiOpenDatabas eA@12 referenced in function _msiopendb
7>_msi.obj : error LNK2019: unresolved external symbol
_MsiCreateRecor d@4 referenced in function _createrecord
7>./_msi.pyd : fatal error LNK1120: 30 unresolved externals
6>callproc.obj : error LNK2019: unresolved external symbol
__imp__SysFreeS tring@4 referenced in function _GetComError
6>cfield.obj : error LNK2001: unresolved external symbol
__imp__SysFreeS tring@4
6>callproc.obj : error LNK2019: unresolved external symbol
__imp__ProgIDFr omCLSID@8 referenced in function _GetComError
6>callproc.obj : error LNK2019: unresolved external symbol
__imp__GetError Info@8 referenced in function _GetComError
6>cfield.obj : error LNK2019: unresolved external symbol
__imp__SysAlloc StringLen@8 referenced in function _BSTR_set
6>cfield.obj : error LNK2019: unresolved external symbol
__imp__SysStrin gLen@4 referenced in function _BSTR_get
6>./_ctypes_d.pyd : fatal error LNK1120: 5 unresolved externals
7>Build log was saved at
"file://d:\Python-2.5\PCbuild8\x8 6-temp-debug\_msi\Buil dLog.htm"
7>_msi - 31 error(s), 0 warning(s)
6>Build log was saved at
"file://d:\Python-2.5\PCbuild8\x8 6-temp-debug\_ctypes\B uildLog.htm"
6>_ctypes - 7 error(s), 0 warning(s)
8>------ Build started: Project: _sqlite3, Configuration: Debug Win32
------
8>Compiling...
8>util.c
8>d:\python-2.5\modules\_sq lite\connection .h(33) : fatal error C1083:
Cannot open include file: 'sqlite3.h': No such file or directory
8>statement.c
8>d:\python-2.5\modules\_sq lite\connection .h(33) : fatal error C1083:
Cannot open include file: 'sqlite3.h': No such file or directory
8>row.c
9>------ Build started: Project: _ctypes_test, Configuration: Debug
Win32 ------
8>d:\python-2.5\modules\_sq lite\connection .h(33) : fatal error C1083:
Cannot open include file: 'sqlite3.h': No such file or directory
9>Linking...
8>module.c
9 Creating library .\./_ctypes_test_d. lib and object
..\./_ctypes_test_d. exp
9>_ctypes_test. obj : error LNK2019: unresolved external symbol
__imp__SysAlloc String@4 referenced in function _GetString
9>./_ctypes_test_d. pyd : fatal error LNK1120: 1 unresolved externals
9>Build log was saved at
"file://d:\Python-2.5\PCbuild8\x8 6-temp-debug\_ctypes_t est\BuildLog.ht m"
9>_ctypes_test - 2 error(s), 0 warning(s)
8>d:\python-2.5\modules\_sq lite\connection .h(33) : fatal error C1083:
Cannot open include file: 'sqlite3.h': No such file or directory
8>microprotocol s.c
10>------ Build started: Project: pythoncore_pgo, Configuration:
Release Win32 ------
8>d:\python-2.5\modules\_sq lite\connection .h(33) : fatal error C1083:
Cannot open include file: 'sqlite3.h': No such file or directory
8>cursor.c
10>Performing Custom Build Step
8>d:\python-2.5\modules\_sq lite\connection .h(33) : fatal error C1083:
Cannot open include file: 'sqlite3.h': No such file or directory
8>connection.c
10>File not found - python.exe*
10>0 File(s) copied
10>Compiling resources...
10>..\PC\python _nt.rc(12) : fatal error RC1015: cannot open include
file 'pythonnt_rc.h' .
10>Build log was saved at
"file://d:\Python-2.5\PCbuild8\x8 6-temp-release\pythonc ore_pgo\BuildLo g.htm"
10>pythoncore_p go - 1 error(s), 0 warning(s)
8>d:\python-2.5\modules\_sq lite\connection .h(33) : fatal error C1083:
Cannot open include file: 'sqlite3.h': No such file or directory
8>Generating Code...
8>Build log was saved at
"file://d:\Python-2.5\PCbuild8\x8 6-temp-debug\_sqlite3\ BuildLog.htm"
8>_sqlite3 - 7 error(s), 0 warning(s)
11>------ Build started: Project: _elementtree, Configuration: Debug
Win32 ------
11>Linking...
11 Creating library .\./_elementtree_d. lib and object
..\./_elementtree_d. exp
11>Embedding manifest...
12>------ Build started: Project: winsound, Configuration: Debug Win32
------
11>Build log was saved at
"file://d:\Python-2.5\PCbuild8\x8 6-temp-debug\_elementt ree\BuildLog.ht m"
11>_elementtree - 0 error(s), 0 warning(s)
12>Linking...
12 Creating library .\./winsound_d.lib and object .\./winsound_d.exp
12>winsound.obj : error LNK2019: unresolved external symbol
__imp__PlaySoun dA@12 referenced in function _sound_playsoun d
12>./winsound_d.pyd : fatal error LNK1120: 1 unresolved externals
12>Build log was saved at
"file://d:\Python-2.5\PCbuild8\x8 6-temp-debug\winsound\ BuildLog.htm"
12>winsound - 2 error(s), 0 warning(s)
13>------ Build started: Project: unicodedata, Configuration: Debug
Win32 ------
13>Linking...
13 Creating library .\./unicodedata_d.l ib and object
..\./unicodedata_d.e xp
13>Embedding manifest...
14>------ Build started: Project: select, Configuration: Debug Win32
------
14>Linking...
14 Creating library .\./select_d.lib and object .\./select_d.exp
14>selectmodule .obj : error LNK2019: unresolved external symbol
_WSAGetLastErro r@0 referenced in function _select_select
14>selectmodule .obj : error LNK2019: unresolved external symbol
_select@20 referenced in function _select_select
14>selectmodule .obj : error LNK2019: unresolved external symbol
___WSAFDIsSet@8 referenced in function _set2list
14>./select_d.pyd : fatal error LNK1120: 3 unresolved externals
14>Build log was saved at
"file://d:\Python-2.5\PCbuild8\x8 6-temp-debug\select\Bu ildLog.htm"
14>select - 4 error(s), 0 warning(s)
13>Build log was saved at
"file://d:\Python-2.5\PCbuild8\x8 6-temp-debug\unicodeda ta\BuildLog.htm "
13>unicodedata - 0 error(s), 0 warning(s)
15>------ Build started: Project: pythonw, Configuration: Debug Win32
------
15>Linking...
15>Embedding manifest...
15>Build log was saved at
"file://d:\Python-2.5\PCbuild8\x8 6-temp-debug\pythonw\B uildLog.htm"
15>pythonw - 0 error(s), 0 warning(s)
========== Build: 7 succeeded, 8 failed, 0 up-to-date, 0 skipped
==========

f rom schreef:
----- Forwarded Message ----
From: Josiah Carlson <jc******@uci.e du>
To: f rom <et******@yahoo .com>; wx************@ lists.wxwidgets .org
Sent: Monday, December 4, 2006 10:03:28 PM
Subject: Re: [wxPython-users] 1>make_buildinf o.obj : error LNK2019: unresolved external symbol __imp__RegQuery ValueExA@24 referenced in function _make_buildinfo 2
Ask on py*********@pyt hon.org .

- Josiah

f rom <et******@yahoo .comwrote:
I am trying to debug a segfault which I can not pin down with a simple pytjon script.
For this I have downloaded the free Microsoft visual express c++.
However I am having problems building python2.5.
Anyone have experience with this ?

1>------ Rebuild All started: Project: make_buildinfo, Configuration: Debug Win32 ------
1>Deleting intermediate and output files for project 'make_buildinfo ', configuration 'Debug|Win32'
1>Compiling...
1>make_buildinf o.c
1>d:\python-2.5\pcbuild8\ma ke_buildinfo.c( 43) : warning C4996: 'strcat' was declared deprecated
1 c:\program files\microsoft visual studio 8\vc\include\st ring.h(78) : see declaration of 'strcat'
1 Message: 'This function or variable may be unsafe. Consider using strcat_s instead. To disable deprecation, use _CRT_SECURE_NO_ DEPRECATE. See online help for details.'
1>d:\python-2.5\pcbuild8\ma ke_buildinfo.c( 47) : warning C4996: 'strcat' was declared deprecated
1 c:\program files\microsoft visual studio 8\vc\include\st ring.h(78) : see declaration of 'strcat'
1 Message: 'This function or variable may be unsafe. Consider using strcat_s instead. To disable deprecation, use _CRT_SECURE_NO_ DEPRECATE. See online help for details.'
1>d:\python-2.5\pcbuild8\ma ke_buildinfo.c( 63) : warning C4996: 'strcat' was declared deprecated
1 c:\program files\microsoft visual studio 8\vc\include\st ring.h(78) : see declaration of 'strcat'
1 Message: 'This function or variable may be unsafe. Consider using strcat_s instead. To disable deprecation, use _CRT_SECURE_NO_ DEPRECATE. See online help for details.'
1>d:\python-2.5\pcbuild8\ma ke_buildinfo.c( 66) : warning C4996: 'strcat' was declared deprecated
1 c:\program files\microsoft visual studio 8\vc\include\st ring.h(78) : see declaration of 'strcat'
1 Message: 'This function or variable may be unsafe. Consider using strcat_s instead. To disable deprecation, use _CRT_SECURE_NO_ DEPRECATE. See online help for details.'
1>d:\python-2.5\pcbuild8\ma ke_buildinfo.c( 69) : warning C4996: 'strcat' was declared deprecated
1 c:\program files\microsoft visual studio 8\vc\include\st ring.h(78) : see declaration of 'strcat'
1 Message: 'This function or variable may be unsafe. Consider using strcat_s instead. To disable deprecation, use _CRT_SECURE_NO_ DEPRECATE. See online help for details.'
1>d:\python-2.5\pcbuild8\ma ke_buildinfo.c( 72) : warning C4996: 'strcat' was declared deprecated
1 c:\program files\microsoft visual studio 8\vc\include\st ring.h(78) : see declaration of 'strcat'
1 Message: 'This function or variable may be unsafe. Consider using strcat_s instead. To disable deprecation, use _CRT_SECURE_NO_ DEPRECATE. See online help for details.'
1>d:\python-2.5\pcbuild8\ma ke_buildinfo.c( 73) : warning C4996: 'strcat' was declared deprecated
1 c:\program files\microsoft visual studio 8\vc\include\st ring.h(78) : see declaration of 'strcat'
1 Message: 'This function or variable may be unsafe. Consider using strcat_s instead. To disable deprecation, use _CRT_SECURE_NO_ DEPRECATE. See online help for details.'
1>d:\python-2.5\pcbuild8\ma ke_buildinfo.c( 81) : warning C4996: 'strcat' was declared deprecated
1 c:\program files\microsoft visual studio 8\vc\include\st ring.h(78) : see declaration of 'strcat'
1 Message: 'This function or variable may be unsafe. Consider using strcat_s instead. To disable deprecation, use _CRT_SECURE_NO_ DEPRECATE. See online help for details.'
1>d:\python-2.5\pcbuild8\ma ke_buildinfo.c( 83) : warning C4996: 'strcat' was declared deprecated
1 c:\program files\microsoft visual studio 8\vc\include\st ring.h(78) : see declaration of 'strcat'
1 Message: 'This function or variable may be unsafe. Consider using strcat_s instead. To disable deprecation, use _CRT_SECURE_NO_ DEPRECATE. See online help for details.'
1>d:\python-2.5\pcbuild8\ma ke_buildinfo.c( 84) : warning C4996: 'strcat' was declared deprecated
1 c:\program files\microsoft visual studio 8\vc\include\st ring.h(78) : see declaration of 'strcat'
1 Message: 'This function or variable may be unsafe. Consider using strcat_s instead. To disable deprecation, use _CRT_SECURE_NO_ DEPRECATE. See online help for details.'
1>d:\python-2.5\pcbuild8\ma ke_buildinfo.c( 88) : warning C4996: 'unlink' was declared deprecated
1 c:\program files\microsoft visual studio 8\vc\include\st dio.h(290) : see declaration of 'unlink'
1 Message: 'The POSIX name for this item is deprecated. Instead, use the ISO C++ conformant name: _unlink. See online help for details.'
1>Compiling manifest to resources...
1>Linking...
1>make_buildinf o.obj : error LNK2019: unresolved external symbol __imp__RegQuery ValueExA@24 referenced in function _make_buildinfo 2
1>make_buildinf o.obj : error LNK2019: unresolved external symbol __imp__RegOpenK eyA@12 referenced in function _make_buildinfo 2
1>./make_buildinfo. exe : fatal error LNK1120: 2 unresolved externals
1>Build log was saved at "file://d:\Python-2.5\PCbuild8\x8 6-temp-release\make_bu ildinfo\BuildLo g.htm"
1>make_buildinf o - 3 error(s), 11 warning(s)
========== Rebuild All: 0 succeeded, 1 failed, 0 skipped ==========


_______________ _______________ _______________ _______________ _______________ _________
Want to start your own business?
Learn how on Yahoo! Small Business.
http://smallbusiness.yahoo.com/r-index

---------------------------------------------------------------------
To unsubscribe, e-mail: wx************* ***********@lis ts.wxwidgets.or g
For additional commands, e-mail: wx************* ****@lists.wxwi dgets.org



_______________ _______________ _______________ _______________ _______________ _________
Cheap talk?
Check out Yahoo! Messenger's low PC-to-Phone call rates.
http://voice.yahoo.com
Dec 5 '06 #2
etaoinbe wrote:
I have added advapi32 &user32. This is my current result :

I am quite surprised there are so many issues with the solution file
that comes with python25.
I remember py23 built out of the box :(
python 2.5 also builds out of the box, if you're using an ordinary
visual studio installation, instead of an incomplete "express" edition
of unknown quality.

</F>

Dec 5 '06 #3

This thread has been closed and replies have been disabled. Please start a new discussion.

Similar topics

3
3729
by: sheep | last post by:
Hi, I are trying to update my project from VC6 to VC7.1. However, I got the following error. Is there anyone knows what the error means and what I should do to solve this problem? Thank you very much. error LNK2019: unresolved external symbol __imp__PathFindExtensionA@4 referenced in function "long __stdcall ATL::AtlLoadTypeLib(struct HINSTANCE__ *,unsigned short const *,unsigned short * *,struct ITypeLib * *)"...
3
5848
by: YAN KANG / SU | last post by:
Hi, All I am migrating to Studio .NET 2003 from Studio 6.0 and Studio .NET 2002. When I compiled my code, which is compilable both in VC++ 6.0 and Studio .NET 2002, I have an error LNK2019 as the following ------------------------------------------------------------------------- error LNK2019: unresolved external symbol "class CPV3<double> __cdecl operator*(double,class CPV3<double> const &)" (??D@YA?AV?$CPV3@N@@NABV0@@Z) referenced in...
0
1884
by: Steve Caine | last post by:
Hello, I'm new to the .NET world and trying to learn from the sample code in Visual Studio 2003's C++ environment. When I try to compile their "MECalculator" sample (which demonstrates communication between a .NET DLL and a C++ console app) I get a link error on the MECalcSrv DLL project: "MECalcSrv error LNK2019: unresolved external symbol _main referenced in function _mainCRTStartup"
3
9368
by: NewsGroup | last post by:
Hello, I am trying to write a code to interface with ILOG OPL development studio using their C++ libraries and header files. But I am encountering linker issues, an example being - error LNK2019: unresolved external symbol "public: void __thiscall IloOplModelI::printSolution(class std::basic_ostream<char,struct std::char_traits<char &,long)" (?printSolution@IloOplModelI@@QAEXAAV?$basic_ostream@DU?$char_traits@D@std@@@std@@J@Z)
3
2607
by: adina | last post by:
Hello, I have the following problem. I keep getting these linker errors, although I included all the header files and provided the right settings for the project. I use the C++ compiler in .NET framework. Here are the linker erros: NetworkAnalyzer error LNK2019: unresolved external symbol "class nbPacketDecoder * __cdecl nbGetPacketDecoder(int,char *,int)" referenced in function "public: __thiscall CCaptureWindow::CCaptureWindow(class...
9
9560
by: Trent | last post by:
Here is the error while using Visual Studio 2005 Error 1 error LNK2019: unresolved external symbol "void __cdecl print(int,int,int,int,int,int,int,int)" (?print@@YAXHHHHHHHH@Z) referenced in function _main assign2.obj Thanks a lot ! Here is the code:
4
9056
by: jk2l | last post by:
Error 10 error LNK2019: unresolved external symbol __imp__glBindTexture@8 referenced in function "public: void __thiscall GLTexture::Use(void)" (?Use@GLTexture@@QAEXXZ) GLTexture.obj Error 11 error LNK2019: unresolved external symbol __imp__glEnable@4 referenced in function "public: void __thiscall GLTexture::Use(void)" (?Use@GLTexture@@QAEXXZ) GLTexture.obj Error 12 error LNK2001: unresolved external symbol __imp__glEnable@4 Model_3DS.obj ...
1
15091
by: eraserwars | last post by:
I have been googeling every possible solution, but I cannot seem to fix LNK2019. My code is below, but I just cannot understand how anything related to LNK2019 from Microsoft's help center applies to it. GRRRRRR. The error says 1>Lab Four.obj : error LNK2019: unresolved external symbol "void __cdecl highLowReport(class weatherStation * const,int)" (?highLowReport@@YAXQAVweatherStation@@H@Z) referenced in function _main 1>Lab Four.obj :...
2
11483
by: hjazz | last post by:
Hi all, I'm new to VS, and I'm using Visual Studio .NET 2003. I'm trying to write a program which uses pcap libraries. However, I keep getting the following errors: error LNK2019: unresolved external symbol __imp__inet_ntoa@4 referenced in function _got_packet error LNK2019: unresolved external symbol __imp__ntohs@4 referenced in function _got_packet error LNK2019: unresolved external symbol _Search referenced in function _got_packet...
0
8886
marktang
by: marktang | last post by:
ONU (Optical Network Unit) is one of the key components for providing high-speed Internet services. Its primary function is to act as an endpoint device located at the user's premises. However, people are often confused as to whether an ONU can Work As a Router. In this blog post, we’ll explore What is ONU, What Is Router, ONU & Router’s main usage, and What is the difference between ONU and Router. Let’s take a closer look ! Part I. Meaning of...
0
9401
Oralloy
by: Oralloy | last post by:
Hello folks, I am unable to find appropriate documentation on the type promotion of bit-fields when using the generalised comparison operator "<=>". The problem is that using the GNU compilers, it seems that the internal comparison operator "<=>" tries to promote arguments from unsigned to signed. This is as boiled down as I can make it. Here is my compilation command: g++-12 -std=c++20 -Wnarrowing bit_field.cpp Here is the code in...
0
8093
agi2029
by: agi2029 | last post by:
Let's talk about the concept of autonomous AI software engineers and no-code agents. These AIs are designed to manage the entire lifecycle of a software development project—planning, coding, testing, and deployment—without human intervention. Imagine an AI that can take a project description, break it down, write the code, debug it, and then launch it, all on its own.... Now, this would greatly impact the work of software developers. The idea...
1
6702
isladogs
by: isladogs | last post by:
The next Access Europe User Group meeting will be on Wednesday 1 May 2024 starting at 18:00 UK time (6PM UTC+1) and finishing by 19:30 (7.30PM). In this session, we are pleased to welcome a new presenter, Adolph Dupré who will be discussing some powerful techniques for using class modules. He will explain when you may want to use classes instead of User Defined Types (UDT). For example, to manage the data in unbound forms. Adolph will...
0
6010
by: conductexam | last post by:
I have .net C# application in which I am extracting data from word file and save it in database particularly. To store word all data as it is I am converting the whole word file firstly in HTML and then checking html paragraph one by one. At the time of converting from word file to html my equations which are in the word document file was convert into image. Globals.ThisAddIn.Application.ActiveDocument.Select();...
0
4514
by: TSSRALBI | last post by:
Hello I'm a network technician in training and I need your help. I am currently learning how to create and manage the different types of VPNs and I have a question about LAN-to-LAN VPNs. The last exercise I practiced was to create a LAN-to-LAN VPN between two Pfsense firewalls, by using IPSEC protocols. I succeeded, with both firewalls in the same network. But I'm wondering if it's possible to do the same thing, with 2 Pfsense firewalls...
0
4781
by: adsilva | last post by:
A Windows Forms form does not have the event Unload, like VB6. What one acts like?
1
3218
by: 6302768590 | last post by:
Hai team i want code for transfer the data from one system to another through IP address by using C# our system has to for every 5mins then we have to update the data what the data is updated we have to send another system
2
2632
muto222
by: muto222 | last post by:
How can i add a mobile payment intergratation into php mysql website.

By using Bytes.com and it's services, you agree to our Privacy Policy and Terms of Use.

To disable or enable advertisements and analytics tracking please visit the manage ads & tracking page.