By using this site, you agree to our updated Privacy Policy and our Terms of Use. Manage your Cookies Settings.
424,493 Members | 1,250 Online
Bytes IT Community
+ Ask a Question
Need help? Post your question and get tips & solutions from a community of 424,493 IT Pros & Developers. It's quick & easy.

Program Causes Compiler to Crash

P: n/a
------ Build started: Project: USDAver2, Configuration: Debug .NET ------

Preparing resources...
Updating references...
Performing main compilation...
error CS0583: Internal Compiler Error (0xc0000005 at address 535F072A): likely culprit is 'BIND'.

An internal error has occurred in the compiler. To work around this problem, try simplifying or changing the program near the locations listed below. Locations at the top of the list are closer to the point at which the internal error occurred.

c:\csoftware\usdaver2\nutrientdataobject.cs(43,15) : error CS0584: Internal Compiler Error: stage 'BIND' symbol 'USDAver2.NUTSTableBuilder.Build()'
c:\csoftware\usdaver2\nutrientdataobject.cs(43,15) : error CS0584: Internal Compiler Error: stage 'COMPILE' symbol 'USDAver2.NUTSTableBuilder.Build()'
c:\csoftware\usdaver2\nutrientdataobject.cs(43,15) : error CS0584: Internal Compiler Error: stage 'COMPILE' symbol 'USDAver2.NUTSTableBuilder.Build()'
c:\csoftware\usdaver2\nutrientdataobject.cs(43,15) : error CS0584: Internal Compiler Error: stage 'COMPILE' symbol 'USDAver2.NUTSTableBuilder.Build()'
c:\csoftware\usdaver2\nutrientdataobject.cs(30,15) : error CS0584: Internal Compiler Error: stage 'COMPILE' symbol 'USDAver2.NUTSTableBuilder'
c:\csoftware\usdaver2\nutrientdataobject.cs(8,11): error CS0584: Internal Compiler Error: stage 'COMPILE' symbol 'USDAver2'
c:\csoftware\usdaver2\nutrientdataobject.cs(1,1): error CS0584: Internal Compiler Error: stage 'COMPILE' symbol ''
C:\CSoftware\USDAver2\NutrientDataObject.cs: error CS0586: Internal Compiler Error: stage 'COMPILE'
error CS0587: Internal Compiler Error: stage 'COMPILE'
error CS0587: Internal Compiler Error: stage 'BEGIN'
error CS0583: Internal Compiler Error (0xc0000005 at address 5362514E): likely culprit is 'BIND'.

An internal error has occurred in the compiler. To work around this problem, try simplifying or changing the program near the locations listed below. Locations at the top of the list are closer to the point at which the internal error occurred.

c:\csoftware\usdaver2\nutrientdataobject.cs(43,15) : error CS0584: Internal Compiler Error: stage 'BIND' symbol 'USDAver2.NUTSTableBuilder.Build()'
c:\csoftware\usdaver2\nutrientdataobject.cs(43,15) : error CS0584: Internal Compiler Error: stage 'COMPILE' symbol 'USDAver2.NUTSTableBuilder.Build()'
c:\csoftware\usdaver2\nutrientdataobject.cs(43,15) : error CS0584: Internal Compiler Error: stage 'COMPILE' symbol 'USDAver2.NUTSTableBuilder.Build()'
c:\csoftware\usdaver2\nutrientdataobject.cs(43,15) : error CS0584: Internal Compiler Error: stage 'COMPILE' symbol 'USDAver2.NUTSTableBuilder.Build()'
c:\csoftware\usdaver2\nutrientdataobject.cs(30,15) : error CS0584: Internal Compiler Error: stage 'COMPILE' symbol 'USDAver2.NUTSTableBuilder'
c:\csoftware\usdaver2\nutrientdataobject.cs(8,11): error CS0584: Internal Compiler Error: stage 'COMPILE' symbol 'USDAver2'
c:\csoftware\usdaver2\nutrientdataobject.cs(1,1): error CS0584: Internal Compiler Error: stage 'COMPILE' symbol ''
C:\CSoftware\USDAver2\NutrientDataObject.cs: error CS0586: Internal Compiler Error: stage 'COMPILE'
error CS0587: Internal Compiler Error: stage 'COMPILE'
error CS0587: Internal Compiler Error: stage 'BEGIN'

Build complete -- 23 errors, 0 warnings
Building satellite assemblies...

---------------------- Done ----------------------

Build: 0 succeeded, 1 failed, 0 skipped

Nov 15 '05 #1
Share this Question
Share on Google+
3 Replies


P: n/a
Hi Mark,

Did you try rebuilding?
Also, delete bin and obj folders.

--
Miha Markic - RightHand .NET consulting & development
miha at rthand com
www.rthand.com

"Mark Rockman" <an*******@discussions.microsoft.com> wrote in message
news:18**********************************@microsof t.com...
------ Build started: Project: USDAver2, Configuration: Debug .NET ------

Preparing resources...
Updating references...
Performing main compilation...
error CS0583: Internal Compiler Error (0xc0000005 at address 535F072A): likely culprit is 'BIND'.
An internal error has occurred in the compiler. To work around this problem, try simplifying or changing the program near the locations listed
below. Locations at the top of the list are closer to the point at which the
internal error occurred.
c:\csoftware\usdaver2\nutrientdataobject.cs(43,15) : error CS0584: Internal Compiler Error: stage 'BIND' symbol 'USDAver2.NUTSTableBuilder.Build()' c:\csoftware\usdaver2\nutrientdataobject.cs(43,15) : error CS0584: Internal Compiler Error: stage 'COMPILE' symbol 'USDAver2.NUTSTableBuilder.Build()' c:\csoftware\usdaver2\nutrientdataobject.cs(43,15) : error CS0584: Internal Compiler Error: stage 'COMPILE' symbol 'USDAver2.NUTSTableBuilder.Build()' c:\csoftware\usdaver2\nutrientdataobject.cs(43,15) : error CS0584: Internal Compiler Error: stage 'COMPILE' symbol 'USDAver2.NUTSTableBuilder.Build()' c:\csoftware\usdaver2\nutrientdataobject.cs(30,15) : error CS0584: Internal Compiler Error: stage 'COMPILE' symbol 'USDAver2.NUTSTableBuilder' c:\csoftware\usdaver2\nutrientdataobject.cs(8,11): error CS0584: Internal Compiler Error: stage 'COMPILE' symbol 'USDAver2' c:\csoftware\usdaver2\nutrientdataobject.cs(1,1): error CS0584: Internal Compiler Error: stage 'COMPILE' symbol '' C:\CSoftware\USDAver2\NutrientDataObject.cs: error CS0586: Internal Compiler Error: stage 'COMPILE' error CS0587: Internal Compiler Error: stage 'COMPILE'
error CS0587: Internal Compiler Error: stage 'BEGIN'
error CS0583: Internal Compiler Error (0xc0000005 at address 5362514E): likely culprit is 'BIND'.
An internal error has occurred in the compiler. To work around this problem, try simplifying or changing the program near the locations listed
below. Locations at the top of the list are closer to the point at which the
internal error occurred.
c:\csoftware\usdaver2\nutrientdataobject.cs(43,15) : error CS0584: Internal Compiler Error: stage 'BIND' symbol 'USDAver2.NUTSTableBuilder.Build()' c:\csoftware\usdaver2\nutrientdataobject.cs(43,15) : error CS0584: Internal Compiler Error: stage 'COMPILE' symbol 'USDAver2.NUTSTableBuilder.Build()' c:\csoftware\usdaver2\nutrientdataobject.cs(43,15) : error CS0584: Internal Compiler Error: stage 'COMPILE' symbol 'USDAver2.NUTSTableBuilder.Build()' c:\csoftware\usdaver2\nutrientdataobject.cs(43,15) : error CS0584: Internal Compiler Error: stage 'COMPILE' symbol 'USDAver2.NUTSTableBuilder.Build()' c:\csoftware\usdaver2\nutrientdataobject.cs(30,15) : error CS0584: Internal Compiler Error: stage 'COMPILE' symbol 'USDAver2.NUTSTableBuilder' c:\csoftware\usdaver2\nutrientdataobject.cs(8,11): error CS0584: Internal Compiler Error: stage 'COMPILE' symbol 'USDAver2' c:\csoftware\usdaver2\nutrientdataobject.cs(1,1): error CS0584: Internal Compiler Error: stage 'COMPILE' symbol '' C:\CSoftware\USDAver2\NutrientDataObject.cs: error CS0586: Internal Compiler Error: stage 'COMPILE' error CS0587: Internal Compiler Error: stage 'COMPILE'
error CS0587: Internal Compiler Error: stage 'BEGIN'

Build complete -- 23 errors, 0 warnings
Building satellite assemblies...

---------------------- Done ----------------------

Build: 0 succeeded, 1 failed, 0 skipped

Nov 15 '05 #2

P: n/a
If that doesn't work, take alook at the code around the error line as
suggested by the compiler. Look for any constructs that you don't use
often(or ever), perhaps overly complicated loops or event handlers or what
have you. Chances are a few code chances will fix the problem, however if
you can identify what causes it and produce a short program that exhibits
the answer, please post that here so that the chances of the compiler team
seeing it and determining what went wrong are increased.

If you have any specific questions, go ahead and repost, but without source
code there is nothing specific anyone can do to help you. ICE's are a
particularly nasty beast when they hit for reasons other than things like
Miha suggested.
"Miha Markic" <miha at rthand com> wrote in message
news:uP**************@TK2MSFTNGP10.phx.gbl...
Hi Mark,

Did you try rebuilding?
Also, delete bin and obj folders.

--
Miha Markic - RightHand .NET consulting & development
miha at rthand com
www.rthand.com

"Mark Rockman" <an*******@discussions.microsoft.com> wrote in message
news:18**********************************@microsof t.com...
------ Build started: Project: USDAver2, Configuration: Debug ..NET ------
Preparing resources...
Updating references...
Performing main compilation...
error CS0583: Internal Compiler Error (0xc0000005 at address 535F072A): likely culprit is 'BIND'.

An internal error has occurred in the compiler. To work around this

problem, try simplifying or changing the program near the locations listed
below. Locations at the top of the list are closer to the point at which

the internal error occurred.

c:\csoftware\usdaver2\nutrientdataobject.cs(43,15) : error CS0584:
Internal Compiler Error: stage 'BIND' symbol 'USDAver2.NUTSTableBuilder.Build()'
c:\csoftware\usdaver2\nutrientdataobject.cs(43,15) : error CS0584:
Internal Compiler Error: stage 'COMPILE' symbol 'USDAver2.NUTSTableBuilder.Build()'
c:\csoftware\usdaver2\nutrientdataobject.cs(43,15) : error CS0584:
Internal Compiler Error: stage 'COMPILE' symbol 'USDAver2.NUTSTableBuilder.Build()'
c:\csoftware\usdaver2\nutrientdataobject.cs(43,15) : error CS0584:
Internal Compiler Error: stage 'COMPILE' symbol 'USDAver2.NUTSTableBuilder.Build()'
c:\csoftware\usdaver2\nutrientdataobject.cs(30,15) : error CS0584:
Internal Compiler Error: stage 'COMPILE' symbol 'USDAver2.NUTSTableBuilder'
c:\csoftware\usdaver2\nutrientdataobject.cs(8,11): error CS0584:
Internal Compiler Error: stage 'COMPILE' symbol 'USDAver2'
c:\csoftware\usdaver2\nutrientdataobject.cs(1,1): error CS0584: Internal Compiler Error: stage 'COMPILE' symbol ''
C:\CSoftware\USDAver2\NutrientDataObject.cs: error CS0586: Internal

Compiler Error: stage 'COMPILE'
error CS0587: Internal Compiler Error: stage 'COMPILE'
error CS0587: Internal Compiler Error: stage 'BEGIN'
error CS0583: Internal Compiler Error (0xc0000005 at address 5362514E):

likely culprit is 'BIND'.

An internal error has occurred in the compiler. To work around this

problem, try simplifying or changing the program near the locations listed
below. Locations at the top of the list are closer to the point at which

the internal error occurred.

c:\csoftware\usdaver2\nutrientdataobject.cs(43,15) : error CS0584:
Internal Compiler Error: stage 'BIND' symbol 'USDAver2.NUTSTableBuilder.Build()'
c:\csoftware\usdaver2\nutrientdataobject.cs(43,15) : error CS0584:
Internal Compiler Error: stage 'COMPILE' symbol 'USDAver2.NUTSTableBuilder.Build()'
c:\csoftware\usdaver2\nutrientdataobject.cs(43,15) : error CS0584:
Internal Compiler Error: stage 'COMPILE' symbol 'USDAver2.NUTSTableBuilder.Build()'
c:\csoftware\usdaver2\nutrientdataobject.cs(43,15) : error CS0584:
Internal Compiler Error: stage 'COMPILE' symbol 'USDAver2.NUTSTableBuilder.Build()'
c:\csoftware\usdaver2\nutrientdataobject.cs(30,15) : error CS0584:
Internal Compiler Error: stage 'COMPILE' symbol 'USDAver2.NUTSTableBuilder'
c:\csoftware\usdaver2\nutrientdataobject.cs(8,11): error CS0584:
Internal Compiler Error: stage 'COMPILE' symbol 'USDAver2'
c:\csoftware\usdaver2\nutrientdataobject.cs(1,1): error CS0584: Internal

Compiler Error: stage 'COMPILE' symbol ''
C:\CSoftware\USDAver2\NutrientDataObject.cs: error CS0586: Internal

Compiler Error: stage 'COMPILE'
error CS0587: Internal Compiler Error: stage 'COMPILE'
error CS0587: Internal Compiler Error: stage 'BEGIN'

Build complete -- 23 errors, 0 warnings
Building satellite assemblies...

---------------------- Done ----------------------

Build: 0 succeeded, 1 failed, 0 skipped


Nov 15 '05 #3

P: n/a
Agreed - I've solved them a few times by simply re-working the syntax of the
code in the problem areas. But it's definately a trial and error process.

R.

--
C#, .NET and Complex Adaptive Systems:
http://blogs.geekdojo.net/Richard
"Daniel O'Connell" <onyxkirx@--NOSPAM--comcast.net> wrote in message
news:%2******************@TK2MSFTNGP10.phx.gbl...
If that doesn't work, take alook at the code around the error line as
suggested by the compiler. Look for any constructs that you don't use
often(or ever), perhaps overly complicated loops or event handlers or what
have you. Chances are a few code chances will fix the problem, however if
you can identify what causes it and produce a short program that exhibits
the answer, please post that here so that the chances of the compiler team
seeing it and determining what went wrong are increased.

If you have any specific questions, go ahead and repost, but without source code there is nothing specific anyone can do to help you. ICE's are a
particularly nasty beast when they hit for reasons other than things like
Miha suggested.
"Miha Markic" <miha at rthand com> wrote in message
news:uP**************@TK2MSFTNGP10.phx.gbl...
Hi Mark,

Did you try rebuilding?
Also, delete bin and obj folders.

--
Miha Markic - RightHand .NET consulting & development
miha at rthand com
www.rthand.com

"Mark Rockman" <an*******@discussions.microsoft.com> wrote in message
news:18**********************************@microsof t.com...
------ Build started: Project: USDAver2, Configuration: Debug .NET ------
Preparing resources...
Updating references...
Performing main compilation...
error CS0583: Internal Compiler Error (0xc0000005 at address 535F072A):
likely culprit is 'BIND'.

An internal error has occurred in the compiler. To work around this

problem, try simplifying or changing the program near the locations listed
below. Locations at the top of the list are closer to the point at which

the
internal error occurred.

c:\csoftware\usdaver2\nutrientdataobject.cs(43,15) : error CS0584: Internal
Compiler Error: stage 'BIND' symbol 'USDAver2.NUTSTableBuilder.Build()'
c:\csoftware\usdaver2\nutrientdataobject.cs(43,15) : error CS0584:

Internal
Compiler Error: stage 'COMPILE' symbol

'USDAver2.NUTSTableBuilder.Build()' c:\csoftware\usdaver2\nutrientdataobject.cs(43,15) : error CS0584:

Internal
Compiler Error: stage 'COMPILE' symbol

'USDAver2.NUTSTableBuilder.Build()'
c:\csoftware\usdaver2\nutrientdataobject.cs(43,15) : error CS0584: Internal
Compiler Error: stage 'COMPILE' symbol

'USDAver2.NUTSTableBuilder.Build()'
c:\csoftware\usdaver2\nutrientdataobject.cs(30,15) : error CS0584: Internal
Compiler Error: stage 'COMPILE' symbol 'USDAver2.NUTSTableBuilder'
c:\csoftware\usdaver2\nutrientdataobject.cs(8,11): error CS0584:

Internal
Compiler Error: stage 'COMPILE' symbol 'USDAver2'
c:\csoftware\usdaver2\nutrientdataobject.cs(1,1): error CS0584: Internal Compiler Error: stage 'COMPILE' symbol ''
C:\CSoftware\USDAver2\NutrientDataObject.cs: error CS0586: Internal

Compiler Error: stage 'COMPILE'
error CS0587: Internal Compiler Error: stage 'COMPILE'
error CS0587: Internal Compiler Error: stage 'BEGIN'
error CS0583: Internal Compiler Error (0xc0000005 at address
5362514E): likely culprit is 'BIND'.

An internal error has occurred in the compiler. To work around this

problem, try simplifying or changing the program near the locations listed below. Locations at the top of the list are closer to the point at which

the
internal error occurred.

c:\csoftware\usdaver2\nutrientdataobject.cs(43,15) : error CS0584: Internal
Compiler Error: stage 'BIND' symbol 'USDAver2.NUTSTableBuilder.Build()'
c:\csoftware\usdaver2\nutrientdataobject.cs(43,15) : error CS0584:

Internal
Compiler Error: stage 'COMPILE' symbol

'USDAver2.NUTSTableBuilder.Build()' c:\csoftware\usdaver2\nutrientdataobject.cs(43,15) : error CS0584:

Internal
Compiler Error: stage 'COMPILE' symbol

'USDAver2.NUTSTableBuilder.Build()'
c:\csoftware\usdaver2\nutrientdataobject.cs(43,15) : error CS0584: Internal
Compiler Error: stage 'COMPILE' symbol

'USDAver2.NUTSTableBuilder.Build()'
c:\csoftware\usdaver2\nutrientdataobject.cs(30,15) : error CS0584:

Internal
Compiler Error: stage 'COMPILE' symbol 'USDAver2.NUTSTableBuilder'
c:\csoftware\usdaver2\nutrientdataobject.cs(8,11): error CS0584:

Internal
Compiler Error: stage 'COMPILE' symbol 'USDAver2'
c:\csoftware\usdaver2\nutrientdataobject.cs(1,1): error CS0584:

Internal Compiler Error: stage 'COMPILE' symbol ''
C:\CSoftware\USDAver2\NutrientDataObject.cs: error CS0586: Internal

Compiler Error: stage 'COMPILE'
error CS0587: Internal Compiler Error: stage 'COMPILE'
error CS0587: Internal Compiler Error: stage 'BEGIN'

Build complete -- 23 errors, 0 warnings
Building satellite assemblies...

---------------------- Done ----------------------

Build: 0 succeeded, 1 failed, 0 skipped



Nov 15 '05 #4

This discussion thread is closed

Replies have been disabled for this discussion.